목록RUN (1)
MGIT
vue.js에서 Front단을 상용 배포용으로 빌드하여 파일을 생성 후 압축하려고 했더니 아래와 같은 오류가 출력되었다. 명령어: npm run build ERROR Failed to compile with 1 error 오전 10:38:02 error Entry module not found: Error: Can't resolve 'C:\user\Documents\ZeroMG\backend;tar' in 'C:\user\Documents\ZeroMG\front' ERROR Build failed with errors. npm ERR! code ELIFECYCLE npm ERR! errno 1 npm ERR! xcost-adm-front@1.0.0 build: `vue-cli-service build -..
프론트 기록/Vue.js
2023. 11. 15. 11:23